Fw: make check fails

classic Classic list List threaded Threaded
2 messages Options
Reply | Threaded
Open this post in threaded view
|

Fw: make check fails

Ted Creedon
do the nightly builds include a "make check"?

thanks tedc

________________________________________
From: Ted Creedon
Sent: Tuesday, September 27, 2016 4:30 PM
To: [hidden email]
Subject: make check fails

make check fails with kernel 4.4.21-2 (suse leap 42.2) but works with  kernel 4.1.27-27 (leap 42.1)

Testsuite summary for Heimdal 1.6.99
============================================================================
# TOTAL: 5
# PASS:  4
# SKIP:  0
# XFAIL: 0
# FAIL:  1
# XPASS: 0
# ERROR: 0
============================================================================
See lib/asn1/test-suite.log
Please report to [hidden email]
============================================================================
Makefile:1327: recipe for target 'test-suite.log' failed
make[5]: *** [test-suite.log] Error 1
make[5]: Leaving directory '/data1/heimdal-master.ookpik/heimdal-master/lib/asn1'
Makefile:1433: recipe for target 'check-TESTS' failed
make[4]: *** [check-TESTS] Error 2
make[4]: Leaving directory '/data1/heimdal-master.ookpik/heimdal-master/lib/asn1'
Makefile:1537: recipe for target 'check-am' failed
make[3]: *** [check-am] Error 2
make[3]: Leaving directory '/data1/heimdal-master.ookpik/heimdal-master/lib/asn1'
Makefile:1540: recipe for target 'check' failed
make[2]: *** [check] Error 2
make[2]: Leaving directory '/data1/heimdal-master.ookpik/heimdal-master/lib/asn1'
Makefile:562: recipe for target 'check-recursive' failed
make[1]: *** [check-recursive] Error 1
make[1]: Leaving directory '/data1/heimdal-master.ookpik/heimdal-master/lib'
Makefile:603: recipe for target 'check-recursive' failed
make: *** [check-recursive] Error 1

test-suite.log (390 bytes) Download Attachment
Reply | Threaded
Open this post in threaded view
|

Re: make check fails

Ted Creedon


________________________________________
From: Ted Creedon
Sent: Friday, September 30, 2016 1:57 PM
To: [hidden email]
Subject: Fw: make check fails

do the nightly builds include a "make check"?

thanks tedc

________________________________________
From: Ted Creedon
Sent: Tuesday, September 27, 2016 4:30 PM
To: [hidden email]
Subject: make check fails

make check fails with kernel 4.4.21-2 (suse leap 42.2) but works with  kernel 4.1.27-27 (leap 42.1)

Testsuite summary for Heimdal 1.6.99
============================================================================
# TOTAL: 5
# PASS:  4
# SKIP:  0
# XFAIL: 0
# FAIL:  1
# XPASS: 0
# ERROR: 0
============================================================================
See lib/asn1/test-suite.log
Please report to [hidden email]
============================================================================
Makefile:1327: recipe for target 'test-suite.log' failed
make[5]: *** [test-suite.log] Error 1
make[5]: Leaving directory '/data1/heimdal-master.ookpik/heimdal-master/lib/asn1'
Makefile:1433: recipe for target 'check-TESTS' failed
make[4]: *** [check-TESTS] Error 2
make[4]: Leaving directory '/data1/heimdal-master.ookpik/heimdal-master/lib/asn1'
Makefile:1537: recipe for target 'check-am' failed
make[3]: *** [check-am] Error 2
make[3]: Leaving directory '/data1/heimdal-master.ookpik/heimdal-master/lib/asn1'
Makefile:1540: recipe for target 'check' failed
make[2]: *** [check] Error 2
make[2]: Leaving directory '/data1/heimdal-master.ookpik/heimdal-master/lib/asn1'
Makefile:562: recipe for target 'check-recursive' failed
make[1]: *** [check-recursive] Error 1
make[1]: Leaving directory '/data1/heimdal-master.ookpik/heimdal-master/lib'
Makefile:603: recipe for target 'check-recursive' failed
make: *** [check-recursive] Error 1